EVoR
type: Concept
top concept of: scheme
in scheme: scheme
preferred label: erweiterte Version @de
preferred label: versione revisionata @it
preferred label: version améliorée @fr
preferred label: revisie @nl
preferred label: Eserin geliştirilmiş versiyonu @tr
preferred label: versión mejorada @es
preferred label: versió actualitzada @ca
preferred label: 更新版 @ja
preferred label: 最终审定稿 @zh
preferred label: расширенная версия @ru
preferred label: päivitetty julkaistu versio @fi
preferred label: dopunjena verzija @sr
preferred label: допуњена верзија @sr-cyrl
alternative label: enhanced version of record
alternative label: aktualisierte Version @de
alternative label: version amendée @fr
alternative label: gewijzigde versie @nl
alternative label: versió amb modificacions @ca
alternative label: versió millorada @ca
alternative label: 增补稿、更新版、 追加增订版 @zh
alternative label: ažurirana verzija @sr
alternative label: ажурирана верзија @sr-cyrl
change note:
  comment: Catalan translations were added. Broken matching link was removed: http://purl.org/info:eu-repo/semantics/updatedVersion
  creator: Ilkay Holt
  modified: 2021-06-18T14:23:45+00:00
change note:
  comment: Finnish translation was added.
  creator: Ilkay Holt
  modified: 2021-08-17T18:58:50+00:00
change note:
  comment: Serbian translation was added.
  creator: Milica Sevkusic
  modified: 2022-04-11T10:24:57+00:00
definition: A version of the Version of Record of a resource that has been updated or enhanced by the provision of supplementary material. (adapted from NISO-JAV, https://www.niso.org/publications/niso-rp-8-2008-jav)
editorial note: Chinese translations added July 2022