CVoR
type: Concept
top concept of: scheme
in scheme: scheme
preferred label: korrigierte Version @de
preferred label: versione corretta @it
preferred label: version corrigée @fr
preferred label: herziene versie @nl
preferred label: Eserin düzeltilmiş versiyonu @tr
preferred label: versión corregida @es
preferred label: versió corregida @ca
preferred label: 訂正版 @ja
preferred label: 作者修订稿 @zh
preferred label: исправленная версия @ru
preferred label: korjattu julkaistu versio @fi
preferred label: korigovana verzija @sr
preferred label: коригована верзија @sr-cyrl
alternative label: corrected version of record
alternative label: gecorrigeerde versie @nl
alternative label: versión publicada corregida @es
alternative label: versió publicada corregida @ca
alternative label: 同行评审反馈修订稿 @zh
change note:
  comment: Catalan translations were added. Broken matching link was removed: http://purl.org/info:eu-repo/semantics/updatedVersion
  creator: Ilkay Holt
  modified: 2021-06-18T14:22:04+00:00
change note:
  comment: Finnish translation was added.
  creator: Ilkay Holt
  modified: 2021-08-17T18:58:18+00:00
change note:
  comment: Serbian translation was added.
  creator: Milica Sevkusic
  modified: 2022-04-11T10:40:22+00:00
definition: A version of the Version of Record of a resource in which errors in the VoR have been corrected. The errors may be author errors, publisher errors, or other processing errors. (adapted from NISO-JAV, https://www.niso.org/publications/niso-rp-8-2008-jav)
editorial note: Chinese translations added July 2022