P
type: Concept
top concept of: scheme
in scheme: scheme
preferred label: Korrekturfahne @de
preferred label: bozza @it
preferred label: proefdruk @nl
preferred label: Redakte edilmiş versiyon @tr
preferred label: prueba de galera @es
preferred label: prova d'impremta @ca
preferred label: 校正版 @ja
preferred label: 出版社版式稿 @zh
preferred label: одобрен @ru
preferred label: koevedos @fi
preferred label: probna kopija @sr
preferred label: пробна копија @sr-cyrl
alternative label: proof
alternative label: version @fr
alternative label: drukproef @nl
alternative label: Yayıncı tarafından düzenlenmiş versiyon @tr
alternative label: manuscrito editado @es
alternative label: manuscrito aceptado @es
alternative label: galerada @ca
alternative label: 编辑校订稿、网络优先发布稿 @zh
alternative label: одобрена @ru
alternative label: одобренный @ru
alternative label: одобрено @ru
alternative label: одобренная @ru
alternative label: одобрены @ru
alternative label: одобренные @ru
alternative label: oikovedos @fi
alternative label: korjausvedos @fi
alternative label: probni otisak @sr
alternative label: пробни отисак @sr-cyrl
change note:
  comment: Catalan translations were added.
  creator: Ilkay Holt
  modified: 2021-06-18T14:26:34+00:00
change note:
  comment: Finnish translation was added.
  creator: Ilkay Holt
  modified: 2021-08-17T18:56:33+00:00
change note:
  comment: Serbian translation was added.
  creator: Milica Sevkusic
  modified: 2022-04-11T09:18:43+00:00
definition: A version of a resource that is created as part of the publication process. This includes the copy-edited manuscript, galley proofs (i.e., a typeset version that has not been made up into pages), page proofs, and revised proofs. Some of these versions may remain essentially internal process versions, but others are commonly released from the internal environment (e.g., proofs are sent to authors) and may thus become public, even though they are not authorized to be so. Content has been changed from Accepted Manuscript; layout is the publisher’s. (adapted from NISO-JAV, https://www.niso.org/publications/niso-rp-8-2008-jav)
editorial note: Chinese translations added July 2022